{"text_format":"3","workbook":"xlsx","n_sheets":4,"sheets":["27A","Challan","Annexure","Setups"],"not_rendered":{"macros":1,"defined_names":1},"read":"whole","date_system":"1900"}

{"sheet":"27A","index":0,"n_rows":21,"n_cols":13,"rows_kept":21,"merged":[[1,2,1,6],[2,5,2,6],[3,5,3,6],[4,5,4,6],[8,5,8,6],[9,5,9,6],[10,5,10,6],[11,5,11,6],[12,5,12,6]]}
[]
[null,"Name:","<<COMPANY NAME>>",{"$nulls":8},"Code:",{"$f":"\"0^1^BH^1^26Q^\"&$F$5&\"^A^^^\"&$C$3&\"^^\"&$C$4&\"^No^0^\"&$F$3&\"^\"&$F$4&\"^9^^\"&$C$2&\"^\"&$C$5&\"^^^^\"&$C$9&\"^\"&$C$11&\"^\"&$C$12&\"^\"&$C$14&\"^^^^^^0^^^^\"&$F$9&\"^\"&$C$10&\"^\"&$C$13&\"^32^\"&$F$12&\"^^2^\"&$F$10&\"^\"&$F$11&\"^\"&$C$9&\"^\"&$C$10&\"^\"&$C$12&\"^^^^^2^\"&$C$16&\"^\"&$C$11&\"^\"&$C$13&\"^32^\"&$C$14&\"^\"&$F$12&\"^^\"&$F$13&\"^1^^LineHash\"","v":"0^1^BH^1^26Q^Q2^A^^^^^^No^0^2022-2023^2023-2024^9^^<<COMPANY NAME>>^^^^^^^^^^^^^^0^^^^^^^32^^^2^^^^^^^^^^2^^^^32^^^^^1^^LineHash"}]
[null,"TAN:",null,null,"FY:","2022-2023",{"$nulls":5},"File:",{"$f":"C3&\"_26Q_\"&F3&\"_\"&F5","v":"_26Q_2022-2023_Q2"}]
[null,"PAN:",null,null,"AS:","2023-2024"]
[null,"Branch:",null,null,"Quarter:","Q2",{"$nulls":3},"D:\\RPU_DRAFT\\"]
[]
[]
[null,"Office Address:",null,null,"Responsility Address:"]
[null,"Flat No:",null,null,"PAN:"]
[null,"Building:",null,null,"Name:"]
[null,"Locaton:",null,null,"Position:"]
[null,"Street:",null,null,"Mail ID:"]
[null,"State:",null,null,"Mobile:"]
[null,"PIN:"]
[]
[null,"Receipt No:"]
[]
[]
[]
[null,"Total Challan Count","No. of deductee/ party records",null,"Amount                                                                                                                                                                                       (Rs.)","Tax Deducted / Collected (Rs.)","Tax deposited                                                                 (Total challan amount)                                                                                                          (Rs.)"]
[null,{"$f":"COUNTA(Challan!B:B)-1","v":0},{"$f":"COUNTA(Annexure!$B:$B)-1","v":0},null,{"$f":"SUM(Annexure!E:E)","v":{"v":0,"d":"0.00"}},{"$f":"SUM(Annexure!I:I)","v":{"v":0,"d":"0.00"}},{"$f":"SUM(Challan!B:B)","v":{"v":0,"d":"0.00"}}]

{"sheet":"Challan","index":1,"n_rows":41,"n_cols":8,"rows_kept":41}
["SL","TDS Amount","BSR CODE","Date of Challan","Challan No.","E-Cheque",null,"Code"]
[1,{"$nulls":6},{"$f":"IF(B2>0,\"0^\"&A2+1&\"^CD^1^--Select--^\"&TEXT(B2,\"0.00\")&\"^0.00^0.00^0.00^0.00^0.00^^\"&TEXT(B2,\"0.00\")&\"^^^\"&TEXT(C2,\"0000000\")&\"^^\"&TEXT(D2,\"dd/mm/yyyy\")&\"^^\"&E2&\"^No^0.00^0.00^200^^LineHash\",\"\")","v":""}]
[2,{"$nulls":6},{"$f":"IF(B3>0,\"0^\"&A3+1&\"^CD^1^--Select--^\"&TEXT(B3,\"0.00\")&\"^0.00^0.00^0.00^0.00^0.00^^\"&TEXT(B3,\"0.00\")&\"^^^\"&TEXT(C3,\"0000000\")&\"^^\"&TEXT(D3,\"dd/mm/yyyy\")&\"^^\"&E3&\"^No^0.00^0.00^200^^LineHash\",\"\")","v":""}]
[3,{"$nulls":6},""]
[4,{"$nulls":6},""]
[5,{"$nulls":6},{"$f":"IF(B6>0,\"0^\"&A6+1&\"^CD^1^--Select--^\"&TEXT(B6,\"0.00\")&\"^0.00^0.00^0.00^0.00^0.00^^\"&TEXT(B6,\"0.00\")&\"^^^\"&TEXT(C6,\"0000000\")&\"^^\"&TEXT(D6,\"dd/mm/yyyy\")&\"^^\"&E6&\"^No^0.00^0.00^200^^LineHash\",\"\")","v":""}]
[6,{"$nulls":6},""]
[7,{"$nulls":6},""]
[8,{"$nulls":6},""]
[9,{"$nulls":6},""]
[10,{"$nulls":6},""]
[11,{"$nulls":6},""]
[12,{"$nulls":6},""]
[13,{"$nulls":6},""]
[14,{"$nulls":6},""]
[15,{"$nulls":6},""]
[16,{"$nulls":6},""]
[17,{"$nulls":6},""]
[18,{"$nulls":6},""]
[19,{"$nulls":6},""]
[20,{"$nulls":6},""]
[21,{"$nulls":6},""]
[22,{"$nulls":6},""]
[23,{"$nulls":6},""]
[24,{"$nulls":6},""]
[25,{"$nulls":6},""]
[26,{"$nulls":6},""]
[27,{"$nulls":6},""]
[28,{"$nulls":6},""]
[29,{"$nulls":6},""]
[30,{"$nulls":6},""]
[31,{"$nulls":6},""]
[32,{"$nulls":6},""]
[33,{"$nulls":6},""]
[34,{"$nulls":6},""]
[35,{"$nulls":6},""]
[36,{"$nulls":6},""]
[37,{"$nulls":6},""]
[38,{"$nulls":6},""]
[39,{"$nulls":6},""]
{"$rows_left_out":2}
{"sheet":"Annexure","index":2,"n_rows":51,"n_cols":22,"rows_kept":51}
["Sr. no.","Name of Deductee","PAN","Date on which Tax deducted","Amount on which TDS deducted","TDS","Surcharge","Cess","Total TDS","TDS %","Section","SBI Cheque","Ch.SL","Date on which tax deposited","BSR code","Challan\n no.","Challan\nValue","Company","Count Rows",null,"Code",{"$f":"COUNTA(Challan!B:B)","v":1}]
[1,{"$nulls":7},{"$f":"SUM(F2:H2)","v":0},{"$f":"IFERROR(ROUND(I2/E2*100,4),\"\")","v":""},null,null,{"$f":"IFERROR(INDEX(Challan!$A:$A,MATCH(L2,Challan!$F:$F,0)),\"\")","v":""},{"$f":"IFERROR(INDEX(Challan!$D:$D,MATCH(Annexure!L2,Challan!$F:$F,0)),\"\")","v":""},{"$f":"IFERROR(INDEX(Challan!$C:$C,MATCH(Annexure!L2,Challan!$F:$F,0)),\"\")","v":""},{"$f":"IFERROR(INDEX(Challan!$E:$E,MATCH(Annexure!L2,Challan!$F:$F,0)),\"\")","v":""},{"$f":"IFERROR(INDEX(Challan!$B:$B,MATCH(Annexure!L2,Challan!$F:$F,0)),\"\")","v":""},{"$f":"IF(ISBLANK(C2),\"\",IF(MID(C2,3,1)=\"C\",2,1))","v":""},{"$f":"COUNTIFS($L$2:L2,L2)","v":0},null,{"$f":"IF(S2>0,\"0^\"&$V$1+A2&\"^DD^1^\"&M2&\"^--Select--^\"&O2&\"^\"&TEXT(N2,\"dd/mm/yyyy\")&\"^\"&TEXT(P2,\"00000\")&\"^\"&K2&\"^\"&TEXT(Q2,\"0.00\")&\"^0.00^0.00^\"&TEXT(Q2,\"0.00\")&\"^\"&S2&\"^^^\"&C2&\"^\"&B2&\"^\"&TEXT(D2,\"dd/mm/yyyy\")&\"^\"&TEXT(E2,\"0.00\")&\"^\"&TEXT(F2,\"0.00\")&\"^\"&TEXT(G2,\"0.00\")&\"^\"&TEXT(H2,\"0.00\")&\"^\"&TEXT(I2,\"0.00\")&\"^^\"&TEXT(I2,\"0.00\")&\"^^\"&TEXT(D2,\"dd/mm/yyyy\")&\"^--Select--^\"&TEXT(R2,\"00\")&\"^\"&TEXT(J2,\"0.0000\")&\"^--Select--^^^^^^^^LineHash\",\"\")","v":""}]
[2,{"$nulls":7},{"$f":"SUM(F3:H3)","v":0},{"$f":"IFERROR(ROUND(I3/E3*100,4),\"\")","v":""},null,null,{"$f":"IFERROR(INDEX(Challan!$A:$A,MATCH(L3,Challan!$F:$F,0)),\"\")","v":""},{"$f":"IFERROR(INDEX(Challan!$D:$D,MATCH(Annexure!L3,Challan!$F:$F,0)),\"\")","v":""},{"$f":"IFERROR(INDEX(Challan!$C:$C,MATCH(Annexure!L3,Challan!$F:$F,0)),\"\")","v":""},{"$f":"IFERROR(INDEX(Challan!$E:$E,MATCH(Annexure!L3,Challan!$F:$F,0)),\"\")","v":""},{"$f":"IFERROR(INDEX(Challan!$B:$B,MATCH(Annexure!L3,Challan!$F:$F,0)),\"\")","v":""},{"$f":"IF(ISBLANK(C3),\"\",IF(MID(C3,3,1)=\"C\",2,1))","v":""},{"$f":"COUNTIFS($L$2:L3,L3)","v":0},null,{"$f":"IF(S3>0,\"0^\"&$V$1+A3&\"^DD^1^\"&M3&\"^--Select--^\"&O3&\"^\"&TEXT(N3,\"dd/mm/yyyy\")&\"^\"&TEXT(P3,\"00000\")&\"^\"&K3&\"^\"&TEXT(Q3,\"0.00\")&\"^0.00^0.00^\"&TEXT(Q3,\"0.00\")&\"^\"&S3&\"^^^\"&C3&\"^\"&B3&\"^\"&TEXT(D3,\"dd/mm/yyyy\")&\"^\"&TEXT(E3,\"0.00\")&\"^\"&TEXT(F3,\"0.00\")&\"^\"&TEXT(G3,\"0.00\")&\"^\"&TEXT(H3,\"0.00\")&\"^\"&TEXT(I3,\"0.00\")&\"^^\"&TEXT(I3,\"0.00\")&\"^^\"&TEXT(D3,\"dd/mm/yyyy\")&\"^--Select--^\"&TEXT(R3,\"00\")&\"^\"&TEXT(J3,\"0.0000\")&\"^--Select--^^^^^^^^LineHash\",\"\")","v":""}]
[3,{"$nulls":7},0,"",null,null,{"$f":"IFERROR(INDEX(Challan!$A:$A,MATCH(L4,Challan!$F:$F,0)),\"\")","v":""},{"$f":"IFERROR(INDEX(Challan!$D:$D,MATCH(Annexure!L4,Challan!$F:$F,0)),\"\")","v":""},{"$f":"IFERROR(INDEX(Challan!$C:$C,MATCH(Annexure!L4,Challan!$F:$F,0)),\"\")","v":""},{"$f":"IFERROR(INDEX(Challan!$E:$E,MATCH(Annexure!L4,Challan!$F:$F,0)),\"\")","v":""},{"$f":"IFERROR(INDEX(Challan!$B:$B,MATCH(Annexure!L4,Challan!$F:$F,0)),\"\")","v":""},"",{"$f":"COUNTIFS($L$2:L4,L4)","v":0},null,""]
[4,{"$nulls":7},0,"",null,null,{"$f":"IFERROR(INDEX(Challan!$A:$A,MATCH(L5,Challan!$F:$F,0)),\"\")","v":""},{"$f":"IFERROR(INDEX(Challan!$D:$D,MATCH(Annexure!L5,Challan!$F:$F,0)),\"\")","v":""},{"$f":"IFERROR(INDEX(Challan!$C:$C,MATCH(Annexure!L5,Challan!$F:$F,0)),\"\")","v":""},{"$f":"IFERROR(INDEX(Challan!$E:$E,MATCH(Annexure!L5,Challan!$F:$F,0)),\"\")","v":""},{"$f":"IFERROR(INDEX(Challan!$B:$B,MATCH(Annexure!L5,Challan!$F:$F,0)),\"\")","v":""},"",{"$f":"COUNTIFS($L$2:L5,L5)","v":0},null,""]
[5,{"$nulls":7},{"$f":"SUM(F6:H6)","v":0},"",null,null,{"$f":"IFERROR(INDEX(Challan!$A:$A,MATCH(L6,Challan!$F:$F,0)),\"\")","v":""},{"$f":"IFERROR(INDEX(Challan!$D:$D,MATCH(Annexure!L6,Challan!$F:$F,0)),\"\")","v":""},{"$f":"IFERROR(INDEX(Challan!$C:$C,MATCH(Annexure!L6,Challan!$F:$F,0)),\"\")","v":""},{"$f":"IFERROR(INDEX(Challan!$E:$E,MATCH(Annexure!L6,Challan!$F:$F,0)),\"\")","v":""},{"$f":"IFERROR(INDEX(Challan!$B:$B,MATCH(Annexure!L6,Challan!$F:$F,0)),\"\")","v":""},"",{"$f":"COUNTIFS($L$2:L6,L6)","v":0},null,""]
[6,{"$nulls":7},0,"",null,null,{"$f":"IFERROR(INDEX(Challan!$A:$A,MATCH(L7,Challan!$F:$F,0)),\"\")","v":""},{"$f":"IFERROR(INDEX(Challan!$D:$D,MATCH(Annexure!L7,Challan!$F:$F,0)),\"\")","v":""},{"$f":"IFERROR(INDEX(Challan!$C:$C,MATCH(Annexure!L7,Challan!$F:$F,0)),\"\")","v":""},{"$f":"IFERROR(INDEX(Challan!$E:$E,MATCH(Annexure!L7,Challan!$F:$F,0)),\"\")","v":""},{"$f":"IFERROR(INDEX(Challan!$B:$B,MATCH(Annexure!L7,Challan!$F:$F,0)),\"\")","v":""},"",{"$f":"COUNTIFS($L$2:L7,L7)","v":0},null,""]
[7,{"$nulls":7},{"$f":"SUM(F8:H8)","v":0},{"$f":"IFERROR(ROUND(I8/E8*100,4),\"\")","v":""},null,null,{"$f":"IFERROR(INDEX(Challan!$A:$A,MATCH(L8,Challan!$F:$F,0)),\"\")","v":""},{"$f":"IFERROR(INDEX(Challan!$D:$D,MATCH(Annexure!L8,Challan!$F:$F,0)),\"\")","v":""},{"$f":"IFERROR(INDEX(Challan!$C:$C,MATCH(Annexure!L8,Challan!$F:$F,0)),\"\")","v":""},{"$f":"IFERROR(INDEX(Challan!$E:$E,MATCH(Annexure!L8,Challan!$F:$F,0)),\"\")","v":""},{"$f":"IFERROR(INDEX(Challan!$B:$B,MATCH(Annexure!L8,Challan!$F:$F,0)),\"\")","v":""},{"$f":"IF(ISBLANK(C8),\"\",IF(MID(C8,3,1)=\"C\",2,1))","v":""},{"$f":"COUNTIFS($L$2:L8,L8)","v":0},null,""]
[8,{"$nulls":7},0,"",null,null,{"$f":"IFERROR(INDEX(Challan!$A:$A,MATCH(L9,Challan!$F:$F,0)),\"\")","v":""},{"$f":"IFERROR(INDEX(Challan!$D:$D,MATCH(Annexure!L9,Challan!$F:$F,0)),\"\")","v":""},{"$f":"IFERROR(INDEX(Challan!$C:$C,MATCH(Annexure!L9,Challan!$F:$F,0)),\"\")","v":""},{"$f":"IFERROR(INDEX(Challan!$E:$E,MATCH(Annexure!L9,Challan!$F:$F,0)),\"\")","v":""},{"$f":"IFERROR(INDEX(Challan!$B:$B,MATCH(Annexure!L9,Challan!$F:$F,0)),\"\")","v":""},"",{"$f":"COUNTIFS($L$2:L9,L9)","v":0},null,""]
[9,{"$nulls":7},0,"",null,null,{"$f":"IFERROR(INDEX(Challan!$A:$A,MATCH(L10,Challan!$F:$F,0)),\"\")","v":""},{"$f":"IFERROR(INDEX(Challan!$D:$D,MATCH(Annexure!L10,Challan!$F:$F,0)),\"\")","v":""},{"$f":"IFERROR(INDEX(Challan!$C:$C,MATCH(Annexure!L10,Challan!$F:$F,0)),\"\")","v":""},{"$f":"IFERROR(INDEX(Challan!$E:$E,MATCH(Annexure!L10,Challan!$F:$F,0)),\"\")","v":""},{"$f":"IFERROR(INDEX(Challan!$B:$B,MATCH(Annexure!L10,Challan!$F:$F,0)),\"\")","v":""},"",{"$f":"COUNTIFS($L$2:L10,L10)","v":0},null,""]
[10,{"$nulls":7},0,"",null,null,{"$f":"IFERROR(INDEX(Challan!$A:$A,MATCH(L11,Challan!$F:$F,0)),\"\")","v":""},{"$f":"IFERROR(INDEX(Challan!$D:$D,MATCH(Annexure!L11,Challan!$F:$F,0)),\"\")","v":""},{"$f":"IFERROR(INDEX(Challan!$C:$C,MATCH(Annexure!L11,Challan!$F:$F,0)),\"\")","v":""},{"$f":"IFERROR(INDEX(Challan!$E:$E,MATCH(Annexure!L11,Challan!$F:$F,0)),\"\")","v":""},{"$f":"IFERROR(INDEX(Challan!$B:$B,MATCH(Annexure!L11,Challan!$F:$F,0)),\"\")","v":""},"",{"$f":"COUNTIFS($L$2:L11,L11)","v":0},null,""]
[11,{"$nulls":7},0,"",null,null,{"$f":"IFERROR(INDEX(Challan!$A:$A,MATCH(L12,Challan!$F:$F,0)),\"\")","v":""},{"$f":"IFERROR(INDEX(Challan!$D:$D,MATCH(Annexure!L12,Challan!$F:$F,0)),\"\")","v":""},{"$f":"IFERROR(INDEX(Challan!$C:$C,MATCH(Annexure!L12,Challan!$F:$F,0)),\"\")","v":""},{"$f":"IFERROR(INDEX(Challan!$E:$E,MATCH(Annexure!L12,Challan!$F:$F,0)),\"\")","v":""},{"$f":"IFERROR(INDEX(Challan!$B:$B,MATCH(Annexure!L12,Challan!$F:$F,0)),\"\")","v":""},"",{"$f":"COUNTIFS($L$2:L12,L12)","v":0},null,""]
[12,{"$nulls":7},0,"",null,null,{"$f":"IFERROR(INDEX(Challan!$A:$A,MATCH(L13,Challan!$F:$F,0)),\"\")","v":""},{"$f":"IFERROR(INDEX(Challan!$D:$D,MATCH(Annexure!L13,Challan!$F:$F,0)),\"\")","v":""},{"$f":"IFERROR(INDEX(Challan!$C:$C,MATCH(Annexure!L13,Challan!$F:$F,0)),\"\")","v":""},{"$f":"IFERROR(INDEX(Challan!$E:$E,MATCH(Annexure!L13,Challan!$F:$F,0)),\"\")","v":""},{"$f":"IFERROR(INDEX(Challan!$B:$B,MATCH(Annexure!L13,Challan!$F:$F,0)),\"\")","v":""},"",{"$f":"COUNTIFS($L$2:L13,L13)","v":0},null,""]
[13,{"$nulls":7},0,"",null,null,{"$f":"IFERROR(INDEX(Challan!$A:$A,MATCH(L14,Challan!$F:$F,0)),\"\")","v":""},{"$f":"IFERROR(INDEX(Challan!$D:$D,MATCH(Annexure!L14,Challan!$F:$F,0)),\"\")","v":""},{"$f":"IFERROR(INDEX(Challan!$C:$C,MATCH(Annexure!L14,Challan!$F:$F,0)),\"\")","v":""},{"$f":"IFERROR(INDEX(Challan!$E:$E,MATCH(Annexure!L14,Challan!$F:$F,0)),\"\")","v":""},{"$f":"IFERROR(INDEX(Challan!$B:$B,MATCH(Annexure!L14,Challan!$F:$F,0)),\"\")","v":""},"",{"$f":"COUNTIFS($L$2:L14,L14)","v":0},null,""]
[14,{"$nulls":7},0,"",null,null,{"$f":"IFERROR(INDEX(Challan!$A:$A,MATCH(L15,Challan!$F:$F,0)),\"\")","v":""},{"$f":"IFERROR(INDEX(Challan!$D:$D,MATCH(Annexure!L15,Challan!$F:$F,0)),\"\")","v":""},{"$f":"IFERROR(INDEX(Challan!$C:$C,MATCH(Annexure!L15,Challan!$F:$F,0)),\"\")","v":""},{"$f":"IFERROR(INDEX(Challan!$E:$E,MATCH(Annexure!L15,Challan!$F:$F,0)),\"\")","v":""},{"$f":"IFERROR(INDEX(Challan!$B:$B,MATCH(Annexure!L15,Challan!$F:$F,0)),\"\")","v":""},"",{"$f":"COUNTIFS($L$2:L15,L15)","v":0},null,""]
[15,{"$nulls":7},0,"",null,null,{"$f":"IFERROR(INDEX(Challan!$A:$A,MATCH(L16,Challan!$F:$F,0)),\"\")","v":""},{"$f":"IFERROR(INDEX(Challan!$D:$D,MATCH(Annexure!L16,Challan!$F:$F,0)),\"\")","v":""},{"$f":"IFERROR(INDEX(Challan!$C:$C,MATCH(Annexure!L16,Challan!$F:$F,0)),\"\")","v":""},{"$f":"IFERROR(INDEX(Challan!$E:$E,MATCH(Annexure!L16,Challan!$F:$F,0)),\"\")","v":""},{"$f":"IFERROR(INDEX(Challan!$B:$B,MATCH(Annexure!L16,Challan!$F:$F,0)),\"\")","v":""},"",{"$f":"COUNTIFS($L$2:L16,L16)","v":0},null,""]
[16,{"$nulls":7},0,"",null,null,{"$f":"IFERROR(INDEX(Challan!$A:$A,MATCH(L17,Challan!$F:$F,0)),\"\")","v":""},{"$f":"IFERROR(INDEX(Challan!$D:$D,MATCH(Annexure!L17,Challan!$F:$F,0)),\"\")","v":""},{"$f":"IFERROR(INDEX(Challan!$C:$C,MATCH(Annexure!L17,Challan!$F:$F,0)),\"\")","v":""},{"$f":"IFERROR(INDEX(Challan!$E:$E,MATCH(Annexure!L17,Challan!$F:$F,0)),\"\")","v":""},{"$f":"IFERROR(INDEX(Challan!$B:$B,MATCH(Annexure!L17,Challan!$F:$F,0)),\"\")","v":""},"",{"$f":"COUNTIFS($L$2:L17,L17)","v":0},null,""]
[17,{"$nulls":7},0,"",null,null,{"$f":"IFERROR(INDEX(Challan!$A:$A,MATCH(L18,Challan!$F:$F,0)),\"\")","v":""},{"$f":"IFERROR(INDEX(Challan!$D:$D,MATCH(Annexure!L18,Challan!$F:$F,0)),\"\")","v":""},{"$f":"IFERROR(INDEX(Challan!$C:$C,MATCH(Annexure!L18,Challan!$F:$F,0)),\"\")","v":""},{"$f":"IFERROR(INDEX(Challan!$E:$E,MATCH(Annexure!L18,Challan!$F:$F,0)),\"\")","v":""},{"$f":"IFERROR(INDEX(Challan!$B:$B,MATCH(Annexure!L18,Challan!$F:$F,0)),\"\")","v":""},"",{"$f":"COUNTIFS($L$2:L18,L18)","v":0},null,""]
[18,{"$nulls":7},0,"",null,null,{"$f":"IFERROR(INDEX(Challan!$A:$A,MATCH(L19,Challan!$F:$F,0)),\"\")","v":""},{"$f":"IFERROR(INDEX(Challan!$D:$D,MATCH(Annexure!L19,Challan!$F:$F,0)),\"\")","v":""},{"$f":"IFERROR(INDEX(Challan!$C:$C,MATCH(Annexure!L19,Challan!$F:$F,0)),\"\")","v":""},{"$f":"IFERROR(INDEX(Challan!$E:$E,MATCH(Annexure!L19,Challan!$F:$F,0)),\"\")","v":""},{"$f":"IFERROR(INDEX(Challan!$B:$B,MATCH(Annexure!L19,Challan!$F:$F,0)),\"\")","v":""},"",{"$f":"COUNTIFS($L$2:L19,L19)","v":0},null,""]
[19,{"$nulls":7},0,"",null,null,{"$f":"IFERROR(INDEX(Challan!$A:$A,MATCH(L20,Challan!$F:$F,0)),\"\")","v":""},{"$f":"IFERROR(INDEX(Challan!$D:$D,MATCH(Annexure!L20,Challan!$F:$F,0)),\"\")","v":""},{"$f":"IFERROR(INDEX(Challan!$C:$C,MATCH(Annexure!L20,Challan!$F:$F,0)),\"\")","v":""},{"$f":"IFERROR(INDEX(Challan!$E:$E,MATCH(Annexure!L20,Challan!$F:$F,0)),\"\")","v":""},{"$f":"IFERROR(INDEX(Challan!$B:$B,MATCH(Annexure!L20,Challan!$F:$F,0)),\"\")","v":""},"",{"$f":"COUNTIFS($L$2:L20,L20)","v":0},null,""]
[20,{"$nulls":7},0,"",null,null,{"$f":"IFERROR(INDEX(Challan!$A:$A,MATCH(L21,Challan!$F:$F,0)),\"\")","v":""},{"$f":"IFERROR(INDEX(Challan!$D:$D,MATCH(Annexure!L21,Challan!$F:$F,0)),\"\")","v":""},{"$f":"IFERROR(INDEX(Challan!$C:$C,MATCH(Annexure!L21,Challan!$F:$F,0)),\"\")","v":""},{"$f":"IFERROR(INDEX(Challan!$E:$E,MATCH(Annexure!L21,Challan!$F:$F,0)),\"\")","v":""},{"$f":"IFERROR(INDEX(Challan!$B:$B,MATCH(Annexure!L21,Challan!$F:$F,0)),\"\")","v":""},"",{"$f":"COUNTIFS($L$2:L21,L21)","v":0},null,""]
[21,{"$nulls":7},0,"",null,null,{"$f":"IFERROR(INDEX(Challan!$A:$A,MATCH(L22,Challan!$F:$F,0)),\"\")","v":""},{"$f":"IFERROR(INDEX(Challan!$D:$D,MATCH(Annexure!L22,Challan!$F:$F,0)),\"\")","v":""},{"$f":"IFERROR(INDEX(Challan!$C:$C,MATCH(Annexure!L22,Challan!$F:$F,0)),\"\")","v":""},{"$f":"IFERROR(INDEX(Challan!$E:$E,MATCH(Annexure!L22,Challan!$F:$F,0)),\"\")","v":""},{"$f":"IFERROR(INDEX(Challan!$B:$B,MATCH(Annexure!L22,Challan!$F:$F,0)),\"\")","v":""},"",{"$f":"COUNTIFS($L$2:L22,L22)","v":0},null,""]
[22,{"$nulls":7},0,"",null,null,{"$f":"IFERROR(INDEX(Challan!$A:$A,MATCH(L23,Challan!$F:$F,0)),\"\")","v":""},{"$f":"IFERROR(INDEX(Challan!$D:$D,MATCH(Annexure!L23,Challan!$F:$F,0)),\"\")","v":""},{"$f":"IFERROR(INDEX(Challan!$C:$C,MATCH(Annexure!L23,Challan!$F:$F,0)),\"\")","v":""},{"$f":"IFERROR(INDEX(Challan!$E:$E,MATCH(Annexure!L23,Challan!$F:$F,0)),\"\")","v":""},{"$f":"IFERROR(INDEX(Challan!$B:$B,MATCH(Annexure!L23,Challan!$F:$F,0)),\"\")","v":""},"",{"$f":"COUNTIFS($L$2:L23,L23)","v":0},null,""]
[23,{"$nulls":7},0,"",null,null,{"$f":"IFERROR(INDEX(Challan!$A:$A,MATCH(L24,Challan!$F:$F,0)),\"\")","v":""},{"$f":"IFERROR(INDEX(Challan!$D:$D,MATCH(Annexure!L24,Challan!$F:$F,0)),\"\")","v":""},{"$f":"IFERROR(INDEX(Challan!$C:$C,MATCH(Annexure!L24,Challan!$F:$F,0)),\"\")","v":""},{"$f":"IFERROR(INDEX(Challan!$E:$E,MATCH(Annexure!L24,Challan!$F:$F,0)),\"\")","v":""},{"$f":"IFERROR(INDEX(Challan!$B:$B,MATCH(Annexure!L24,Challan!$F:$F,0)),\"\")","v":""},"",{"$f":"COUNTIFS($L$2:L24,L24)","v":0},null,""]
[24,{"$nulls":7},0,"",null,null,{"$f":"IFERROR(INDEX(Challan!$A:$A,MATCH(L25,Challan!$F:$F,0)),\"\")","v":""},{"$f":"IFERROR(INDEX(Challan!$D:$D,MATCH(Annexure!L25,Challan!$F:$F,0)),\"\")","v":""},{"$f":"IFERROR(INDEX(Challan!$C:$C,MATCH(Annexure!L25,Challan!$F:$F,0)),\"\")","v":""},{"$f":"IFERROR(INDEX(Challan!$E:$E,MATCH(Annexure!L25,Challan!$F:$F,0)),\"\")","v":""},{"$f":"IFERROR(INDEX(Challan!$B:$B,MATCH(Annexure!L25,Challan!$F:$F,0)),\"\")","v":""},"",{"$f":"COUNTIFS($L$2:L25,L25)","v":0},null,""]
[25,{"$nulls":7},0,"",null,null,{"$f":"IFERROR(INDEX(Challan!$A:$A,MATCH(L26,Challan!$F:$F,0)),\"\")","v":""},{"$f":"IFERROR(INDEX(Challan!$D:$D,MATCH(Annexure!L26,Challan!$F:$F,0)),\"\")","v":""},{"$f":"IFERROR(INDEX(Challan!$C:$C,MATCH(Annexure!L26,Challan!$F:$F,0)),\"\")","v":""},{"$f":"IFERROR(INDEX(Challan!$E:$E,MATCH(Annexure!L26,Challan!$F:$F,0)),\"\")","v":""},{"$f":"IFERROR(INDEX(Challan!$B:$B,MATCH(Annexure!L26,Challan!$F:$F,0)),\"\")","v":""},"",{"$f":"COUNTIFS($L$2:L26,L26)","v":0},null,""]
[26,{"$nulls":7},0,"",null,null,{"$f":"IFERROR(INDEX(Challan!$A:$A,MATCH(L27,Challan!$F:$F,0)),\"\")","v":""},{"$f":"IFERROR(INDEX(Challan!$D:$D,MATCH(Annexure!L27,Challan!$F:$F,0)),\"\")","v":""},{"$f":"IFERROR(INDEX(Challan!$C:$C,MATCH(Annexure!L27,Challan!$F:$F,0)),\"\")","v":""},{"$f":"IFERROR(INDEX(Challan!$E:$E,MATCH(Annexure!L27,Challan!$F:$F,0)),\"\")","v":""},{"$f":"IFERROR(INDEX(Challan!$B:$B,MATCH(Annexure!L27,Challan!$F:$F,0)),\"\")","v":""},"",{"$f":"COUNTIFS($L$2:L27,L27)","v":0},null,""]
[27,{"$nulls":7},0,"",null,null,{"$f":"IFERROR(INDEX(Challan!$A:$A,MATCH(L28,Challan!$F:$F,0)),\"\")","v":""},{"$f":"IFERROR(INDEX(Challan!$D:$D,MATCH(Annexure!L28,Challan!$F:$F,0)),\"\")","v":""},{"$f":"IFERROR(INDEX(Challan!$C:$C,MATCH(Annexure!L28,Challan!$F:$F,0)),\"\")","v":""},{"$f":"IFERROR(INDEX(Challan!$E:$E,MATCH(Annexure!L28,Challan!$F:$F,0)),\"\")","v":""},{"$f":"IFERROR(INDEX(Challan!$B:$B,MATCH(Annexure!L28,Challan!$F:$F,0)),\"\")","v":""},"",{"$f":"COUNTIFS($L$2:L28,L28)","v":0},null,""]
[28,{"$nulls":7},0,"",null,null,{"$f":"IFERROR(INDEX(Challan!$A:$A,MATCH(L29,Challan!$F:$F,0)),\"\")","v":""},{"$f":"IFERROR(INDEX(Challan!$D:$D,MATCH(Annexure!L29,Challan!$F:$F,0)),\"\")","v":""},{"$f":"IFERROR(INDEX(Challan!$C:$C,MATCH(Annexure!L29,Challan!$F:$F,0)),\"\")","v":""},{"$f":"IFERROR(INDEX(Challan!$E:$E,MATCH(Annexure!L29,Challan!$F:$F,0)),\"\")","v":""},{"$f":"IFERROR(INDEX(Challan!$B:$B,MATCH(Annexure!L29,Challan!$F:$F,0)),\"\")","v":""},"",{"$f":"COUNTIFS($L$2:L29,L29)","v":0},null,""]
[29,{"$nulls":7},0,"",null,null,{"$f":"IFERROR(INDEX(Challan!$A:$A,MATCH(L30,Challan!$F:$F,0)),\"\")","v":""},{"$f":"IFERROR(INDEX(Challan!$D:$D,MATCH(Annexure!L30,Challan!$F:$F,0)),\"\")","v":""},{"$f":"IFERROR(INDEX(Challan!$C:$C,MATCH(Annexure!L30,Challan!$F:$F,0)),\"\")","v":""},{"$f":"IFERROR(INDEX(Challan!$E:$E,MATCH(Annexure!L30,Challan!$F:$F,0)),\"\")","v":""},{"$f":"IFERROR(INDEX(Challan!$B:$B,MATCH(Annexure!L30,Challan!$F:$F,0)),\"\")","v":""},"",{"$f":"COUNTIFS($L$2:L30,L30)","v":0},null,""]
[30,{"$nulls":7},0,"",null,null,{"$f":"IFERROR(INDEX(Challan!$A:$A,MATCH(L31,Challan!$F:$F,0)),\"\")","v":""},{"$f":"IFERROR(INDEX(Challan!$D:$D,MATCH(Annexure!L31,Challan!$F:$F,0)),\"\")","v":""},{"$f":"IFERROR(INDEX(Challan!$C:$C,MATCH(Annexure!L31,Challan!$F:$F,0)),\"\")","v":""},{"$f":"IFERROR(INDEX(Challan!$E:$E,MATCH(Annexure!L31,Challan!$F:$F,0)),\"\")","v":""},{"$f":"IFERROR(INDEX(Challan!$B:$B,MATCH(Annexure!L31,Challan!$F:$F,0)),\"\")","v":""},"",{"$f":"COUNTIFS($L$2:L31,L31)","v":0},null,""]
[31,{"$nulls":7},0,"",null,null,{"$f":"IFERROR(INDEX(Challan!$A:$A,MATCH(L32,Challan!$F:$F,0)),\"\")","v":""},{"$f":"IFERROR(INDEX(Challan!$D:$D,MATCH(Annexure!L32,Challan!$F:$F,0)),\"\")","v":""},{"$f":"IFERROR(INDEX(Challan!$C:$C,MATCH(Annexure!L32,Challan!$F:$F,0)),\"\")","v":""},{"$f":"IFERROR(INDEX(Challan!$E:$E,MATCH(Annexure!L32,Challan!$F:$F,0)),\"\")","v":""},{"$f":"IFERROR(INDEX(Challan!$B:$B,MATCH(Annexure!L32,Challan!$F:$F,0)),\"\")","v":""},"",{"$f":"COUNTIFS($L$2:L32,L32)","v":0},null,""]
[32,{"$nulls":7},0,"",null,null,{"$f":"IFERROR(INDEX(Challan!$A:$A,MATCH(L33,Challan!$F:$F,0)),\"\")","v":""},{"$f":"IFERROR(INDEX(Challan!$D:$D,MATCH(Annexure!L33,Challan!$F:$F,0)),\"\")","v":""},{"$f":"IFERROR(INDEX(Challan!$C:$C,MATCH(Annexure!L33,Challan!$F:$F,0)),\"\")","v":""},{"$f":"IFERROR(INDEX(Challan!$E:$E,MATCH(Annexure!L33,Challan!$F:$F,0)),\"\")","v":""},{"$f":"IFERROR(INDEX(Challan!$B:$B,MATCH(Annexure!L33,Challan!$F:$F,0)),\"\")","v":""},"",{"$f":"COUNTIFS($L$2:L33,L33)","v":0},null,""]
[33,{"$nulls":7},0,"",null,null,{"$f":"IFERROR(INDEX(Challan!$A:$A,MATCH(L34,Challan!$F:$F,0)),\"\")","v":""},{"$f":"IFERROR(INDEX(Challan!$D:$D,MATCH(Annexure!L34,Challan!$F:$F,0)),\"\")","v":""},{"$f":"IFERROR(INDEX(Challan!$C:$C,MATCH(Annexure!L34,Challan!$F:$F,0)),\"\")","v":""},{"$f":"IFERROR(INDEX(Challan!$E:$E,MATCH(Annexure!L34,Challan!$F:$F,0)),\"\")","v":""},{"$f":"IFERROR(INDEX(Challan!$B:$B,MATCH(Annexure!L34,Challan!$F:$F,0)),\"\")","v":""},"",{"$f":"COUNTIFS($L$2:L34,L34)","v":0},null,""]
[34,{"$nulls":7},0,"",null,null,{"$f":"IFERROR(INDEX(Challan!$A:$A,MATCH(L35,Challan!$F:$F,0)),\"\")","v":""},{"$f":"IFERROR(INDEX(Challan!$D:$D,MATCH(Annexure!L35,Challan!$F:$F,0)),\"\")","v":""},{"$f":"IFERROR(INDEX(Challan!$C:$C,MATCH(Annexure!L35,Challan!$F:$F,0)),\"\")","v":""},{"$f":"IFERROR(INDEX(Challan!$E:$E,MATCH(Annexure!L35,Challan!$F:$F,0)),\"\")","v":""},{"$f":"IFERROR(INDEX(Challan!$B:$B,MATCH(Annexure!L35,Challan!$F:$F,0)),\"\")","v":""},"",{"$f":"COUNTIFS($L$2:L35,L35)","v":0},null,""]
[35,{"$nulls":7},0,"",null,null,{"$f":"IFERROR(INDEX(Challan!$A:$A,MATCH(L36,Challan!$F:$F,0)),\"\")","v":""},{"$f":"IFERROR(INDEX(Challan!$D:$D,MATCH(Annexure!L36,Challan!$F:$F,0)),\"\")","v":""},{"$f":"IFERROR(INDEX(Challan!$C:$C,MATCH(Annexure!L36,Challan!$F:$F,0)),\"\")","v":""},{"$f":"IFERROR(INDEX(Challan!$E:$E,MATCH(Annexure!L36,Challan!$F:$F,0)),\"\")","v":""},{"$f":"IFERROR(INDEX(Challan!$B:$B,MATCH(Annexure!L36,Challan!$F:$F,0)),\"\")","v":""},"",{"$f":"COUNTIFS($L$2:L36,L36)","v":0},null,""]
[36,{"$nulls":7},0,"",null,null,{"$f":"IFERROR(INDEX(Challan!$A:$A,MATCH(L37,Challan!$F:$F,0)),\"\")","v":""},{"$f":"IFERROR(INDEX(Challan!$D:$D,MATCH(Annexure!L37,Challan!$F:$F,0)),\"\")","v":""},{"$f":"IFERROR(INDEX(Challan!$C:$C,MATCH(Annexure!L37,Challan!$F:$F,0)),\"\")","v":""},{"$f":"IFERROR(INDEX(Challan!$E:$E,MATCH(Annexure!L37,Challan!$F:$F,0)),\"\")","v":""},{"$f":"IFERROR(INDEX(Challan!$B:$B,MATCH(Annexure!L37,Challan!$F:$F,0)),\"\")","v":""},"",{"$f":"COUNTIFS($L$2:L37,L37)","v":0},null,""]
[37,{"$nulls":7},0,"",null,null,{"$f":"IFERROR(INDEX(Challan!$A:$A,MATCH(L38,Challan!$F:$F,0)),\"\")","v":""},{"$f":"IFERROR(INDEX(Challan!$D:$D,MATCH(Annexure!L38,Challan!$F:$F,0)),\"\")","v":""},{"$f":"IFERROR(INDEX(Challan!$C:$C,MATCH(Annexure!L38,Challan!$F:$F,0)),\"\")","v":""},{"$f":"IFERROR(INDEX(Challan!$E:$E,MATCH(Annexure!L38,Challan!$F:$F,0)),\"\")","v":""},{"$f":"IFERROR(INDEX(Challan!$B:$B,MATCH(Annexure!L38,Challan!$F:$F,0)),\"\")","v":""},"",{"$f":"COUNTIFS($L$2:L38,L38)","v":0},null,""]
[38,{"$nulls":7},0,"",null,null,{"$f":"IFERROR(INDEX(Challan!$A:$A,MATCH(L39,Challan!$F:$F,0)),\"\")","v":""},{"$f":"IFERROR(INDEX(Challan!$D:$D,MATCH(Annexure!L39,Challan!$F:$F,0)),\"\")","v":""},{"$f":"IFERROR(INDEX(Challan!$C:$C,MATCH(Annexure!L39,Challan!$F:$F,0)),\"\")","v":""},{"$f":"IFERROR(INDEX(Challan!$E:$E,MATCH(Annexure!L39,Challan!$F:$F,0)),\"\")","v":""},{"$f":"IFERROR(INDEX(Challan!$B:$B,MATCH(Annexure!L39,Challan!$F:$F,0)),\"\")","v":""},"",{"$f":"COUNTIFS($L$2:L39,L39)","v":0},null,""]
[39,{"$nulls":7},0,"",null,null,{"$f":"IFERROR(INDEX(Challan!$A:$A,MATCH(L40,Challan!$F:$F,0)),\"\")","v":""},{"$f":"IFERROR(INDEX(Challan!$D:$D,MATCH(Annexure!L40,Challan!$F:$F,0)),\"\")","v":""},{"$f":"IFERROR(INDEX(Challan!$C:$C,MATCH(Annexure!L40,Challan!$F:$F,0)),\"\")","v":""},{"$f":"IFERROR(INDEX(Challan!$E:$E,MATCH(Annexure!L40,Challan!$F:$F,0)),\"\")","v":""},{"$f":"IFERROR(INDEX(Challan!$B:$B,MATCH(Annexure!L40,Challan!$F:$F,0)),\"\")","v":""},"",{"$f":"COUNTIFS($L$2:L40,L40)","v":0},null,""]
{"$rows_left_out":12}
{"sheet":"Setups","index":3,"n_rows":13,"n_cols":1,"rows_kept":13}
["Section"]
["4JB"]
["4IB"]
["94A"]
["94C"]
["94H"]
["4JA"]
["4JB"]
["94Q"]
["4JA"]
["4JB"]
["IJA"]
["IJB"]